{"text_format":"1","workbook":"xlsx","n_sheets":6,"sheets":["会員名簿","大会名簿","組別名簿","スコアカード","成績表","操作説明"],"not_rendered":{"charts":0,"images":3,"macros":1,"external_links":0,"defined_names":5,"comments":0,"pivot_tables":0},"unopened":[],"bounds":{"document_bytes":16777216,"sheet_cells":100000,"rows_first":2000,"rows_last":500,"rows_between":2000,"halvings":0,"cell_chars":16384,"cell_head_chars":4096},"cells_cut":0,"cells_raw":0,"read":"whole","date_system":"1900"}

{"sheet":"会員名簿","index":0,"n_rows":998,"n_cols":7,"rows_kept":998,"cut":false,"hidden":false,"merged":[[0,0,0,2],[0,3,0,5]]}
["◆会員登録簿",null,null,"チーム名～生年月日まで直接入力"]
["選手NO","チーム","選手名","ふりがな","性別","生年月日","備　　考"]
[1,"美東","美東　一郎","みとう　いちろう","男","1949-12-19"]
[2,"秋芳","秋芳　花子","しゅうほう　はなこ","女","1947-12-10"]
[3,"美祢","美祢　幸子","みね　さちこ","女","1945-10-10"]
[4,"小郡","小郡　三郎","おごおり　さぶろう","男","1948-05-05","協会長"]
[5,"山口","山口　五郎","やまぐち　ごろう","男","1948-12-14"]
[6,"美東","美東　二郎","みとう　じろう","男","1976-09-03"]
{"$rows_left_out":991}
{"sheet":"大会名簿","index":1,"n_rows":324,"n_cols":11,"rows_kept":324,"cut":false,"hidden":false,"merged":[[2,7,2,10],[2,0,2,5],[0,0,0,2],[1,0,1,2],[1,3,1,5],[0,3,0,10],[1,7,1,10]]}
["大会名",null,null,"第○○回　○○杯グラウンド・ゴルフ大会"]
["組　名",null,null,"Ａ組",null,null,"大会日","令和○年○月○日"]
["選手NOは会員名簿シートから選択",null,null,null,null,null,"○は班長","選手名、生年月日は記入必須です。"]
["選手NO","ＮＯ","組","番号","リーダー","チーム名","選手名","ふりがな","男女","生年月日","年齢"]
[9,1,"１","１","〇",{"$f":"IF($A5=\"\",\"\",VLOOKUP($A5,会員名簿!$A$3:$F$998,2))","v":"萩"},{"$f":"IF($A5=\"\",\"\",VLOOKUP($A5,会員名簿!$A$3:$F$998,3))","v":"萩　　四朗"},{"$f":"IF($A5=\"\",\"\",VLOOKUP($A5,会員名簿!$A$3:$F$998,4))","v":"はぎ　しろう"},{"$f":"IF($A5=\"\",\"\",VLOOKUP($A5,会員名簿!$A$3:$F$998,5))","v":"男"},{"$f":"IF($A5=\"\",\"\",VLOOKUP($A5,会員名簿!$A$3:$F$998,6))","v":"1922-05-03"},{"$f":"IF(J5=\"\",\"\",DATEDIF(J5,TODAY(),\"y\"))","v":100}]
[2,2,"１","２",null,{"$f":"IF($A6=\"\",\"\",VLOOKUP($A6,会員名簿!$A$3:$F$998,2))","v":"秋芳"},{"$f":"IF($A6=\"\",\"\",VLOOKUP($A6,会員名簿!$A$3:$F$998,3))","v":"秋芳　花子"},{"$f":"IF($A6=\"\",\"\",VLOOKUP($A6,会員名簿!$A$3:$F$998,4))","v":"しゅうほう　はなこ"},{"$f":"IF($A6=\"\",\"\",VLOOKUP($A6,会員名簿!$A$3:$F$998,5))","v":"女"},{"$f":"IF($A6=\"\",\"\",VLOOKUP($A6,会員名簿!$A$3:$F$998,6))","v":"1947-12-10"},75]
[5,3,"１","３",null,{"$f":"IF($A7=\"\",\"\",VLOOKUP($A7,会員名簿!$A$3:$F$998,2))","v":"山口"},{"$f":"IF($A7=\"\",\"\",VLOOKUP($A7,会員名簿!$A$3:$F$998,3))","v":"山口　五郎"},{"$f":"IF($A7=\"\",\"\",VLOOKUP($A7,会員名簿!$A$3:$F$998,4))","v":"やまぐち　ごろう"},{"$f":"IF($A7=\"\",\"\",VLOOKUP($A7,会員名簿!$A$3:$F$998,5))","v":"男"},{"$f":"IF($A7=\"\",\"\",VLOOKUP($A7,会員名簿!$A$3:$F$998,6))","v":"1948-12-14"},74]
[null,4,"１","４",null,{"$f":"IF($A8=\"\",\"\",VLOOKUP($A8,会員名簿!$A$3:$F$998,2))","v":""},{"$f":"IF($A8=\"\",\"\",VLOOKUP($A8,会員名簿!$A$3:$F$998,3))","v":""},{"$f":"IF($A8=\"\",\"\",VLOOKUP($A8,会員名簿!$A$3:$F$998,4))","v":""},{"$f":"IF($A8=\"\",\"\",VLOOKUP($A8,会員名簿!$A$3:$F$998,5))","v":""},{"$f":"IF($A8=\"\",\"\",VLOOKUP($A8,会員名簿!$A$3:$F$998,6))","v":""},""]
{"$rows_left_out":317}
{"sheet":"組別名簿","index":2,"n_rows":163,"n_cols":12,"rows_kept":163,"cut":false,"hidden":false,"merged":[[155,0,158,0],[155,6,158,6],[159,0,162,0],[159,6,162,6],[147,0,150,0],[147,6,150,6],[151,0,154,0],[151,6,154,6],[139,0,142,0],[139,6,142,6],[143,0,146,0],[143,6,146,6],[131,0,134,0],[131,6,134,6],[135,0,138,0],[135,6,138,6],[123,0,126,0],[123,6,126,6],[127,0,130,0],[127,6,130,6],[115,0,118,0],[115,6,118,6],[119,0,122,0],[119,6,122,6],[107,0,110,0],[107,6,110,6],[111,0,114,0],[111,6,114,6],[99,0,102,0],[99,6,102,6],[103,0,106,0],[103,6,106,6],[91,0,94,0],[91,6,94,6],[95,0,98,0],[95,6,98,6],[83,0,86,0],[83,6,86,6],[87,0,90,0],[87,6,90,6],[75,0,78,0],[75,6,78,6],[79,0,82,0],[79,6,82,6],[67,0,70,0],[67,6,70,6],[71,0,74,0],[71,6,74,6],[59,0,62,0],[59,6,62,6],[63,0,66,0],[63,6,66,6],[51,0,54,0],[51,6,54,6],[55,0,58,0],[55,6,58,6],[43,0,46,0],[43,6,46,6],[47,0,50,0],[47,6,50,6],[35,0,38,0],[35,6,38,6],[39,0,42,0],[39,6,42,6],[27,0,30,0],[27,6,30,6],[31,0,34,0],[31,6,34,6],[19,0,22,0],[19,6,22,6],[23,0,26,0],[23,6,26,6],[2,10,2,11],[11,0,14,0],[11,6,14,6],[15,0,18,0],[15,6,18,6],[3,0,6,0],[7,0,10,0],[3,6,6,6],[7,6,10,6],[0,0,0,11],[1,0,1,2],[1,3,1,4],[1,6,1,8],[1,9,1,11]]}
[{"$f":"大会名簿!D1","v":"第○○回　○○杯グラウンド・ゴルフ大会"}]
["組名",null,null,{"$f":"大会名簿!D2","v":"Ａ組"},null,null,"大会日",null,null,{"$f":"大会名簿!H2","v":"令和○年○月○日"}]
[null,null,null,null,null,null,null,null,null,null,"（○はリーダー）"]
["１","1",{"$f":"IF(大会名簿!E5=\"\",\"\",大会名簿!E5)","v":"〇"},{"$f":"IF(大会名簿!F5=\"\",\"\",大会名簿!F5)","v":"萩"},{"$f":"IF(大会名簿!G5=\"\",\"\",大会名簿!G5)","v":"萩　　四朗"},{"$f":"IF(大会名簿!I5=\"\",\"\",大会名簿!I5)","v":"男"},"５","1",{"$f":"IF(大会名簿!E37=\"\",\"\",大会名簿!E37)","v":""},{"$f":"IF(大会名簿!F37=\"\",\"\",大会名簿!F37)","v":""},{"$f":"IF(大会名簿!G37=\"\",\"\",大会名簿!G37)","v":""},{"$f":"IF(大会名簿!I37=\"\",\"\",大会名簿!I37)","v":""}]
[null,"２",{"$f":"IF(大会名簿!E6=\"\",\"\",大会名簿!E6)","v":""},{"$f":"IF(大会名簿!F6=\"\",\"\",大会名簿!F6)","v":"秋芳"},{"$f":"IF(大会名簿!G6=\"\",\"\",大会名簿!G6)","v":"秋芳　花子"},{"$f":"IF(大会名簿!I6=\"\",\"\",大会名簿!I6)","v":"女"},null,"２",{"$f":"IF(大会名簿!E38=\"\",\"\",大会名簿!E38)","v":""},{"$f":"IF(大会名簿!F38=\"\",\"\",大会名簿!F38)","v":""},{"$f":"IF(大会名簿!G38=\"\",\"\",大会名簿!G38)","v":""},{"$f":"IF(大会名簿!I38=\"\",\"\",大会名簿!I38)","v":""}]
[null,"３",{"$f":"IF(大会名簿!E7=\"\",\"\",大会名簿!E7)","v":""},{"$f":"IF(大会名簿!F7=\"\",\"\",大会名簿!F7)","v":"山口"},{"$f":"IF(大会名簿!G7=\"\",\"\",大会名簿!G7)","v":"山口　五郎"},{"$f":"IF(大会名簿!I7=\"\",\"\",大会名簿!I7)","v":"男"},null,"３",{"$f":"IF(大会名簿!E39=\"\",\"\",大会名簿!E39)","v":""},{"$f":"IF(大会名簿!F39=\"\",\"\",大会名簿!F39)","v":""},{"$f":"IF(大会名簿!G39=\"\",\"\",大会名簿!G39)","v":""},{"$f":"IF(大会名簿!I39=\"\",\"\",大会名簿!I39)","v":""}]
[null,"４",{"$f":"IF(大会名簿!E8=\"\",\"\",大会名簿!E8)","v":""},{"$f":"IF(大会名簿!F8=\"\",\"\",大会名簿!F8)","v":""},{"$f":"IF(大会名簿!G8=\"\",\"\",大会名簿!G8)","v":""},{"$f":"IF(大会名簿!I8=\"\",\"\",大会名簿!I8)","v":""},null,"４",{"$f":"IF(大会名簿!E40=\"\",\"\",大会名簿!E40)","v":""},{"$f":"IF(大会名簿!F40=\"\",\"\",大会名簿!F40)","v":""},{"$f":"IF(大会名簿!G40=\"\",\"\",大会名簿!G40)","v":""},{"$f":"IF(大会名簿!I40=\"\",\"\",大会名簿!I40)","v":""}]
["組","５",{"$f":"IF(大会名簿!E9=\"\",\"\",大会名簿!E9)","v":""},{"$f":"IF(大会名簿!F9=\"\",\"\",大会名簿!F9)","v":""},{"$f":"IF(大会名簿!G9=\"\",\"\",大会名簿!G9)","v":""},{"$f":"IF(大会名簿!I9=\"\",\"\",大会名簿!I9)","v":""},"組","５",{"$f":"IF(大会名簿!E41=\"\",\"\",大会名簿!E41)","v":""},{"$f":"IF(大会名簿!F41=\"\",\"\",大会名簿!F41)","v":""},{"$f":"IF(大会名簿!G41=\"\",\"\",大会名簿!G41)","v":""},{"$f":"IF(大会名簿!I41=\"\",\"\",大会名簿!I41)","v":""}]
{"$rows_left_out":156}
{"sheet":"スコアカード","index":3,"n_rows":353,"n_cols":64,"rows_kept":353,"cut":false,"hidden":false,"merged":[[0,0,0,15],[0,16,0,31],[0,32,0,47],[0,48,0,63],[1,0,2,1],[1,2,1,3],[2,2,2,3],[1,4,1,15],[1,16,2,17],[1,18,1,19],[1,52,1,63],[2,52,2,53],[2,54,2,55],[2,56,2,59],[2,60,2,61],[2,62,2,63],[1,48,2,49],[1,36,1,47],[2,36,2,37],[2,20,2,21],[2,22,2,23],[1,32,2,33],[1,50,1,51],[2,50,2,51],[2,40,2,43],[2,44,2,45],[2,46,2,47],[2,18,2,19],[2,12,2,13],[2,14,2,15],[2,38,2,39],[1,34,1,35],[2,34,2,35],[2,24,2,27],[2,28,2,29],[2,30,2,31],[1,20,1,31],[7,1,7,2],[7,17,7,18],[7,33,7,34],[7,49,7,50],[8,1,8,2],[8,17,8,18],[8,33,8,34],[8,49,8,50],[5,1,5,2],[5,17,5,18],[5,33,5,34],[5,49,5,50],[6,1,6,2],[6,17,6,18],[6,33,6,34],[6,49,6,50],[3,17,3,18],[3,1,3,2],[4,1,4,2],[4,17,4,18],[4,33,4,34],[4,49,4,50],[3,49,3,50],[3,33,3,34],[11,1,11,2],[11,17,11,18],[11,33,11,34],[11,49,11,50],[12,0,13,1],[12,2,12,3],[13,2,13,3],[12,4,12,15],[13,4,13,5],[13,6,13,7],[13,40,13,43],[13,44,13,45],[13,46,13,47],[12,48,13,49],[12,36,12,47],[13,36,13,37],[9,1,9,2],[9,17,9,18],[9,33,9,34],[9,49,9,50],[10,1,10,2],[10,17,10,18],[10,33,10,34],[10,49,10,50],[13,56,13,59],[12,52,12,63],[13,52,13,53],[13,60,13,61],[13,62,13,63],[14,49,14,50],[12,50,12,51],[13,50,13,51],[13,30,13,31],[12,20,12,31],[13,20,13,21],[13,22,13,23],[12,32,13,33],[13,54,13,55],[18,1,18,2],[18,17,18,18],[18,33,18,34],[18,49,18,50],[12,16,13,17],[12,18,12,19],[13,18,13,19],[13,12,13,13],[13,14,13,15],[13,38,13,39],[12,34,12,35],[13,34,13,35],[13,24,13,27],[13,28,13,29],[19,1,19,2],[19,17,19,18],[19,33,19,34],[19,49,19,50],[16,1,16,2],[16,17,16,18],[16,33,16,34],[16,49,16,50],[17,1,17,2],[17,17,17,18],[17,33,17,34],[17,49,17,50],[14,17,14,18],[14,1,14,2],[15,1,15,2],[15,17,15,18],[15,33,15,34],[15,49,15,50],[14,33,14,34],[23,34,23,35],[24,34,24,35],[24,24,24,27],[24,28,24,29],[24,30,24,31],[22,1,22,2],[22,17,22,18],[22,33,22,34],[22,49,22,50],[23,0,24,1],[23,2,23,3],[24,2,24,3],[23,4,23,15],[24,4,24,5],[24,6,24,7],[20,1,20,2],[20,17,20,18],[20,33,20,34],[20,49,20,50],[21,1,21,2],[21,17,21,18],[21,33,21,34],[21,49,21,50],[25,49,25,50],[25,33,25,34],[25,17,25,18],[25,1,25,2],[26,1,26,2],[26,17,26,18],[26,33,26,34],[26,49,26,50],[24,46,24,47],[23,50,23,51],[23,52,23,63],[24,50,24,51],[24,52,24,53],[24,54,24,55],[24,56,24,59],[24,60,24,61],[24,62,24,63],[23,20,23,31],[24,20,24,21],[24,22,24,23],[23,32,24,33],[23,48,24,49],[23,36,23,47],[24,36,24,37],[24,38,24,39],[24,40,24,43],[24,44,24,45],[23,16,24,17],[23,18,23,19],[24,18,24,19],[24,12,24,13],[24,14,24,15],[31,1,31,2],[31,17,31,18],[31,33,31,34],[31,49,31,50],[32,1,32,2],[32,17,32,18],[32,33,32,34],[32,49,32,50],[29,1,29,2],[29,17,29,18],[29,33,29,34],[29,49,29,50],[30,1,30,2],[30,17,30,18],[30,33,30,34],[30,49,30,50],[27,1,27,2],[27,17,27,18],[27,33,27,34],[27,49,27,50],[28,1,28,2],[28,17,28,18],[28,33,28,34],[28,49,28,50],[34,16,35,17],[34,18,34,19],[35,18,35,19],[35,12,35,13],[35,14,35,15],[34,34,34,35],[35,34,35,35],[35,24,35,27],[35,28,35,29],[35,30,35,31],[33,1,33,2],[33,17,33,18],[33,33,33,34],[33,49,33,50],[34,0,35,1],[34,2,34,3],[35,2,35,3],[34,4,34,15],[35,4,35,5],[35,6,35,7],[35,46,35,47],[34,50,34,51],[34,52,34,63],[35,50,35,51],[35,52,35,53],[35,54,35,55],[35,56,35,59],[35,60,35,61],[35,62,35,63],[34,20,34,31],[35,20,35,21],[35,22,35,23],[34,32,35,33],[34,48,35,49],[34,36,34,47],[35,36,35,37],[35,38,35,39],[35,40,35,43],[35,44,35,45],[40,1,40,2],[40,17,40,18],[40,33,40,34],[40,49,40,50],[41,1,41,2],[41,17,41,18],[41,33,41,34],[41,49,41,50],[38,1,38,2],[38,17,38,18],[38,33,38,34],[38,49,38,50],[39,1,39,2],[39,17,39,18],[39,33,39,34],[39,49,39,50],[36,49,36,50],[36,33,36,34],[36,17,36,18],[36,1,36,2],[37,1,37,2],[37,17,37,18],[37,33,37,34],[37,49,37,50],[46,24,46,27],[46,28,46,29],[46,30,46,31],[45,20,45,31],[46,20,46,21],[44,1,44,2],[44,17,44,18],[44,33,44,34],[44,49,44,50],[46,2,46,3],[45,4,45,15],[46,4,46,5],[46,6,46,7],[45,16,46,17],[45,18,45,19],[42,1,42,2],[42,17,42,18],[42,33,42,34],[42,49,42,50],[43,1,43,2],[43,17,43,18],[43,33,43,34],[43,49,43,50],[47,1,47,2],[2,6,2,7],[2,8,2,11],[2,4,2,5],[13,8,13,11],[24,8,24,11],[35,8,35,11],[46,8,46,11],[45,0,46,1],[45,2,45,3],[45,50,45,51],[45,52,45,63],[46,50,46,51],[46,52,46,53],[46,54,46,55],[46,56,46,59],[46,60,46,61],[46,62,46,63],[46,22,46,23],[45,32,46,33],[45,48,46,49],[45,36,45,47],[46,36,46,37],[46,38,46,39],[46,40,46,43],[46,44,46,45],[46,46,46,47],[46,18,46,19],[46,12,46,13],[46,14,46,15],[45,34,45,35],[46,34,46,35],[47,17,47,18],[89,4,89,15],[90,4,90,5],[90,6,90,7],[90,8,90,11],[90,12,90,13],[90,14,90,15],[56,16,57,17],[56,18,56,19],[57,18,57,19],[78,4,78,15],[79,4,79,5],[79,6,79,7],[79,8,79,11],[79,12,79,13],[79,14,79,15],[67,4,67,15],[68,4,68,5],[68,6,68,7],[68,8,68,11],[68,12,68,13],[68,14,68,15],[56,4,56,15],[57,4,57,5],[57,6,57,7],[57,8,57,11],[57,12,57,13],[57,14,57,15],[62,17,62,18],[67,16,68,17],[67,18,67,19],[68,18,68,19],[47,49,47,50],[166,4,166,15],[167,4,167,5],[167,6,167,7],[167,8,167,11],[167,12,167,13],[167,14,167,15],[57,24,57,27],[57,28,57,29],[57,30,57,31],[144,4,144,15],[145,4,145,5],[145,6,145,7],[145,8,145,11],[145,12,145,13],[145,14,145,15],[133,4,133,15],[134,4,134,5],[134,6,134,7],[134,8,134,11],[134,12,134,13],[134,14,134,15],[47,33,47,34],[122,4,122,15],[123,4,123,5],[123,6,123,7],[123,8,123,11],[123,12,123,13],[123,14,123,15],[56,20,56,31],[57,20,57,21],[57,22,57,23],[52,1,52,2],[52,17,52,18],[52,33,52,34],[52,49,52,50],[53,1,53,2],[53,17,53,18],[53,33,53,34],[53,49,53,50],[50,1,50,2],[50,17,50,18],[50,33,50,34],[50,49,50,50],[51,1,51,2],[51,17,51,18],[51,33,51,34],[51,49,51,50],[48,1,48,2],[48,17,48,18],[48,33,48,34],[48,49,48,50],[49,1,49,2],[49,17,49,18],[49,33,49,34],[49,49,49,50],[56,0,57,1],[56,2,56,3],[57,2,57,3],[210,4,210,15],[59,1,59,2],[61,1,61,2],[63,1,63,2],[65,1,65,2],[67,0,68,1],[67,2,67,3],[54,1,54,2],[54,17,54,18],[54,33,54,34],[54,49,54,50],[55,1,55,2],[55,17,55,18],[55,33,55,34],[55,49,55,50],[111,4,111,15],[112,4,112,5],[112,6,112,7],[112,8,112,11],[112,12,112,13],[112,14,112,15],[100,4,100,15],[101,4,101,5],[101,6,101,7],[101,8,101,11],[101,12,101,13],[101,14,101,15],[56,50,56,51],[62,1,62,2],[56,52,56,63],[57,50,57,51],[57,52,57,53],[57,54,57,55],[57,56,57,59],[57,60,57,61],[57,62,57,63],[56,32,57,33],[56,34,56,35],[57,34,57,35],[56,48,57,49],[56,36,56,47],[57,36,57,37],[57,38,57,39],[57,40,57,43],[57,44,57,45],[57,46,57,47],[62,33,62,34],[62,49,62,50],[63,17,63,18],[63,33,63,34],[63,49,63,50],[60,1,60,2],[60,17,60,18],[60,33,60,34],[60,49,60,50],[61,17,61,18],[61,33,61,34],[61,49,61,50],[58,49,58,50],[58,33,58,34],[58,17,58,18],[58,1,58,2],[59,17,59,18],[59,33,59,34],[59,49,59,50],[66,1,66,2],[66,17,66,18],[66,33,66,34],[66,49,66,50],[68,2,68,3],[211,4,211,5],[211,6,211,7],[211,8,211,11],[70,1,70,2],[72,1,72,2],[64,1,64,2],[64,17,64,18],[64,33,64,34],[64,49,64,50],[65,17,65,18],[65,33,65,34],[65,49,65,50],[67,50,67,51],[74,33,74,34],[74,49,74,50],[75,1,75,2],[75,17,75,18],[75,33,75,34],[75,49,75,50],[71,33,71,34],[71,49,71,50],[72,17,72,18],[72,33,72,34],[72,49,72,50],[73,1,73,2],[73,17,73,18],[73,33,73,34],[67,52,67,63],[68,50,68,51],[68,52,68,53],[68,54,68,55],[68,56,68,59],[68,60,68,61],[68,62,68,63],[67,34,67,35],[68,34,68,35],[68,30,68,31],[67,48,68,49],[67,36,67,47],[68,36,68,37],[68,38,68,39],[68,40,68,43],[68,44,68,45],[68,46,68,47],[67,20,67,31],[68,20,68,21],[68,22,68,23],[68,24,68,27],[68,28,68,29],[67,32,68,33],[73,49,73,50],[69,49,69,50],[69,33,69,34],[69,17,69,18],[69,1,69,2],[70,17,70,18],[70,33,70,34],[70,49,70,50],[74,1,74,2],[79,20,79,21],[79,22,79,23],[79,24,79,27],[79,28,79,29],[79,2,79,3],[79,30,79,31],[78,20,78,31],[71,1,71,2],[71,17,71,18],[74,17,74,18],[78,16,79,17],[78,18,78,19],[79,18,79,19],[81,1,81,2],[81,17,81,18],[83,1,83,2],[83,17,83,18],[85,1,85,2],[76,17,76,18],[76,33,76,34],[76,49,76,50],[77,1,77,2],[77,17,77,18],[77,33,77,34],[77,49,77,50],[76,1,76,2],[78,0,79,1],[78,2,78,3],[82,1,82,2],[82,17,82,18],[82,33,82,34],[82,49,82,50],[83,33,83,34],[83,49,83,50],[80,49,80,50],[80,33,80,34],[80,17,80,18],[80,1,80,2],[81,33,81,34],[81,49,81,50],[78,50,78,51],[78,52,78,63],[79,50,79,51],[79,52,79,53],[79,54,79,55],[79,56,79,59],[79,60,79,61],[79,62,79,63],[78,48,79,49],[78,36,78,47],[79,36,79,37],[79,38,79,39],[79,40,79,43],[79,44,79,45],[79,46,79,47],[78,32,79,33],[78,34,78,35],[79,34,79,35],[86,1,86,2],[86,17,86,18],[86,33,86,34],[86,49,86,50],[87,1,87,2],[87,17,87,18],[87,33,87,34],[87,49,87,50],[84,1,84,2],[84,17,84,18],[84,33,84,34],[84,49,84,50],[85,17,85,18],[85,33,85,34],[85,49,85,50],[90,20,90,21],[90,22,90,23],[90,24,90,27],[90,28,90,29],[89,32,90,33],[88,1,88,2],[88,17,88,18],[88,33,88,34],[93,17,93,18],[93,33,93,34],[93,49,93,50],[94,17,94,18],[94,33,94,34],[94,49,94,50],[91,49,91,50],[91,33,91,34],[91,17,91,18],[91,1,91,2],[92,17,92,18],[92,33,92,34],[92,49,92,50],[89,50,89,51],[88,49,88,50],[89,0,90,1],[89,2,89,3],[90,2,90,3],[89,16,90,17],[89,18,89,19],[90,18,90,19],[104,1,104,2],[104,17,104,18],[104,33,104,34],[104,49,104,50],[105,33,105,34],[105,49,105,50],[102,49,102,50],[89,52,89,63],[90,50,90,51],[90,52,90,53],[90,54,90,55],[90,56,90,59],[90,60,90,61],[90,62,90,63],[89,34,89,35],[90,34,90,35],[90,30,90,31],[89,48,90,49],[89,36,89,47],[90,36,90,37],[90,38,90,39],[90,40,90,43],[90,44,90,45],[90,46,90,47],[89,20,89,31],[92,1,92,2],[94,1,94,2],[96,1,96,2],[98,1,98,2],[100,0,101,1],[93,1,93,2],[95,1,95,2],[100,16,101,17],[100,18,100,19],[101,18,101,19],[103,1,103,2],[97,17,97,18],[97,33,97,34],[97,49,97,50],[98,17,98,18],[98,33,98,34],[98,49,98,50],[95,17,95,18],[95,33,95,34],[95,49,95,50],[96,17,96,18],[96,33,96,34],[96,49,96,50],[100,50,100,51],[100,2,100,3],[99,1,99,2],[99,17,99,18],[99,33,99,34],[99,49,99,50],[101,2,101,3],[102,33,102,34],[102,17,102,18],[102,1,102,2],[103,33,103,34],[103,49,103,50],[103,17,103,18],[97,1,97,2],[100,52,100,63],[101,50,101,51],[101,52,101,53],[101,54,101,55],[101,56,101,59],[101,60,101,61],[101,62,101,63],[101,22,101,23],[101,24,101,27],[101,28,101,29],[100,48,101,49],[100,36,100,47],[101,36,101,37],[101,38,101,39],[101,40,101,43],[101,44,101,45],[101,46,101,47],[100,32,101,33],[100,34,100,35],[101,34,101,35],[101,30,101,31],[100,20,100,31],[101,20,101,21],[105,1,105,2],[105,17,105,18],[107,1,107,2],[110,1,110,2],[110,17,110,18],[110,33,110,34],[110,49,110,50],[111,0,112,1],[111,2,111,3],[112,2,112,3],[111,16,112,17],[111,18,111,19],[112,18,112,19],[108,1,108,2],[108,17,108,18],[108,33,108,34],[108,49,108,50],[109,1,109,2],[109,17,109,18],[109,33,109,34],[109,49,109,50],[106,1,106,2],[106,17,106,18],[106,33,106,34],[106,49,106,50],[107,17,107,18],[107,33,107,34],[107,49,107,50],[113,49,113,50],[113,33,113,34],[113,17,113,18],[113,1,113,2],[114,33,114,34],[114,49,114,50],[111,50,111,51],[111,52,111,63],[112,50,112,51],[112,52,112,53],[112,54,112,55],[112,56,112,59],[112,60,112,61],[112,62,112,63],[111,48,112,49],[111,36,111,47],[112,36,112,37],[112,38,112,39],[112,40,112,43],[112,44,112,45],[112,46,112,47],[114,17,114,18],[111,32,112,33],[111,34,111,35],[112,34,112,35],[112,30,112,31],[111,20,111,31],[112,20,112,21],[112,22,112,23],[112,24,112,27],[112,28,112,29],[114,1,114,2],[120,33,120,34],[120,49,120,50],[121,1,121,2],[121,17,121,18],[121,33,121,34],[121,49,121,50],[120,17,120,18],[118,33,118,34],[118,49,118,50],[119,1,119,2],[119,17,119,18],[119,33,119,34],[119,49,119,50],[118,17,118,18],[115,17,115,18],[115,33,115,34],[115,49,115,50],[116,33,116,34],[116,49,116,50],[117,1,117,2],[117,17,117,18],[117,33,117,34],[117,49,117,50],[116,17,116,18],[116,1,116,2],[118,1,118,2],[120,1,120,2],[115,1,115,2],[123,60,123,61],[123,62,123,63],[124,49,124,50],[124,33,124,34],[124,17,124,18],[124,1,124,2],[122,48,123,49],[122,36,122,47],[123,36,123,37],[123,38,123,39],[122,50,122,51],[122,52,122,63],[123,50,123,51],[123,52,123,53],[123,54,123,55],[123,56,123,59],[122,32,123,33],[122,34,122,35],[123,34,123,35],[123,30,123,31],[122,20,122,31],[123,20,123,21],[123,22,123,23],[123,24,123,27],[123,28,123,29],[122,16,123,17],[122,18,122,19],[123,18,123,19],[122,0,123,1],[122,2,122,3],[123,2,123,3],[129,33,129,34],[129,49,129,50],[130,1,130,2],[130,17,130,18],[130,33,130,34],[130,49,130,50],[129,17,129,18],[127,33,127,34],[127,49,127,50],[128,1,128,2],[128,17,128,18],[128,33,128,34],[128,49,128,50],[125,33,125,34],[125,49,125,50],[126,1,126,2],[126,17,126,18],[126,33,126,34],[126,49,126,50],[125,1,125,2],[125,17,125,18],[127,1,127,2],[127,17,127,18],[129,1,129,2],[133,2,133,3],[134,2,134,3],[222,14,222,15],[136,1,136,2],[138,1,138,2],[140,1,140,2],[142,1,142,2],[144,0,145,1],[144,2,144,3],[137,1,137,2],[131,17,131,18],[131,33,131,34],[131,49,131,50],[132,1,132,2],[132,17,132,18],[132,33,132,34],[132,49,132,50],[222,12,222,13],[131,1,131,2],[222,4,222,5],[133,0,134,1],[133,50,133,51],[139,1,139,2],[139,17,139,18],[139,33,139,34],[139,49,139,50],[140,17,140,18],[140,33,140,34],[140,49,140,50],[137,17,137,18],[137,33,137,34],[137,49,137,50],[133,52,133,63],[134,50,134,51],[134,52,134,53],[134,54,134,55],[134,56,134,59],[134,60,134,61],[134,62,134,63],[133,32,134,33],[133,34,133,35],[134,34,134,35],[134,30,134,31],[133,48,134,49],[133,36,133,47],[134,36,134,37],[134,38,134,39],[133,16,134,17],[133,18,133,19],[134,18,134,19],[133,20,133,31],[134,20,134,21],[134,22,134,23],[134,24,134,27],[134,28,134,29],[138,17,138,18],[138,33,138,34],[138,49,138,50],[135,49,135,50],[135,33,135,34],[135,17,135,18],[135,1,135,2],[136,17,136,18],[136,33,136,34],[136,49,136,50],[143,1,143,2],[143,17,143,18],[143,33,143,34],[143,49,143,50],[145,2,145,3],[232,4,232,15],[144,16,145,17],[144,18,144,19],[145,18,145,19],[147,1,147,2],[141,1,141,2],[141,17,141,18],[141,33,141,34],[141,49,141,50],[142,17,142,18],[142,33,142,34],[142,49,142,50],[144,50,144,51],[150,1,150,2],[150,17,150,18],[150,33,150,34],[150,49,150,50],[144,52,144,63],[145,50,145,51],[145,52,145,53],[145,54,145,55],[145,56,145,59],[145,60,145,61],[145,62,145,63],[145,22,145,23],[145,24,145,27],[145,28,145,29],[144,48,145,49],[144,36,144,47],[145,36,145,37],[145,38,145,39],[147,17,147,18],[149,1,149,2],[149,17,149,18],[144,32,145,33],[144,34,144,35],[145,34,145,35],[145,30,145,31],[144,20,144,31],[145,20,145,21],[151,17,151,18],[151,33,151,34],[151,49,151,50],[148,1,148,2],[148,17,148,18],[148,33,148,34],[148,49,148,50],[149,33,149,34],[149,49,149,50],[146,49,146,50],[146,33,146,34]],"merged_total":2308,"flags":["merged_cut"]}
[1,null,null,null,null,null,null,null,null,null,null,null,null,null,null,null,1,null,null,null,null,null,null,null,null,null,null,null,null,null,null,null,1,null,null,null,null,null,null,null,null,null,null,null,null,null,null,null,1]
["１組",null,"大会名",null,{"$f":"大会名簿!$D$1","v":"第○○回　○○杯グラウンド・ゴルフ大会"},null,null,null,null,null,null,null,null,null,null,null,"１組",null,"大会名",null,{"$f":"大会名簿!$D$1","v":"第○○回　○○杯グラウンド・ゴルフ大会"},null,null,null,null,null,null,null,null,null,null,null,"１組",null,"大会名",null,{"$f":"大会名簿!$D$1","v":"第○○回　○○杯グラウンド・ゴルフ大会"},null,null,null,null,null,null,null,null,null,null,null,"１組",null,"大会名",null,{"$f":"大会名簿!$D$1","v":"第○○回　○○杯グラウンド・ゴルフ大会"}]
[null,null,"組　名",null,{"$f":"大会名簿!$D$2","v":"Ａ組"},null,"大会開催日",null,{"$f":"大会名簿!$H$2","v":"令和○年○月○日"},null,null,null,"スタートホール",null,"１－１",null,null,null,"組　名",null,{"$f":"大会名簿!$D$2","v":"Ａ組"},null,"大会開催日",null,{"$f":"大会名簿!$H$2","v":"令和○年○月○日"},null,null,null,"スタートホール",null,"２－１",null,null,null,"組　名",null,{"$f":"大会名簿!$D$2","v":"Ａ組"},null,"大会開催日",null,{"$f":"大会名簿!$H$2","v":"令和○年○月○日"},null,null,null,"スタートホール",null,"３－１",null,null,null,"組　名",null,{"$f":"大会名簿!$D$2","v":"Ａ組"},null,"大会開催日",null,{"$f":"大会名簿!$H$2","v":"令和○年○月○日"},null,null,null,"スタートホール",null,"４－１"]
["選手NO","　　　 ホールポスト\n\n　氏名",null,1,2,3,4,5,6,7,8,"実打数","１打回数","２打回数","合計","確　認\nサイン","選手NO","　　　 ホールポスト\n\n　氏名",null,1,2,3,4,5,6,7,8,"実打数","１打回数","２打回数","合計","確　認\nサイン","選手NO","　　　 ホールポスト\n\n　氏名",null,1,2,3,4,5,6,7,8,"実打数","１打回数","２打回数","合計","確　認\nサイン","選手NO","　　　 ホールポスト\n\n　氏名",null,1,2,3,4,5,6,7,8,"実打数","１打回数","２打回数","合計","確　認\nサイン"]
[1,{"$f":"大会名簿!G5","v":"萩　　四朗"},null,null,null,null,null,null,null,null,null,null,null,null,null,null,1,{"$f":"B5","v":"萩　　四朗"},null,null,null,null,null,null,null,null,null,null,null,null,null,null,1,null,null,null,null,null,null,null,null,null,null,null,null,null,null,null,1,{"$f":"B5","v":"萩　　四朗"}]
[2,{"$f":"大会名簿!G6","v":"秋芳　花子"},null,null,null,null,null,null,null,null,null,null,null,null,null,null,2,{"$f":"B6","v":"秋芳　花子"},null,null,null,null,null,null,null,null,null,null,null,null,null,null,2,{"$f":"B6","v":"秋芳　花子"},null,null,null,null,null,null,null,null,null,null,null,null,null,null,2,{"$f":"B6","v":"秋芳　花子"}]
[3,{"$f":"大会名簿!G7","v":"山口　五郎"},null,null,null,null,null,null,null,null,null,null,null,null,null,null,3,"山口　五郎",null,null,null,null,null,null,null,null,null,null,null,null,null,null,3,"山口　五郎",null,null,null,null,null,null,null,null,null,null,null,null,null,null,3,"山口　五郎"]
[4,{"$f":"大会名簿!G8","v":""},null,null,null,null,null,null,null,null,null,null,null,null,null,null,4,"",null,null,null,null,null,null,null,null,null,null,null,null,null,null,4,"",null,null,null,null,null,null,null,null,null,null,null,null,null,null,4,""]
{"$rows_left_out":346}
{"sheet":"成績表","index":4,"n_rows":324,"n_cols":26,"rows_kept":324,"cut":false,"hidden":false,"merged":[[2,10,2,12],[2,13,2,15],[2,16,2,18],[2,19,2,21],[0,0,0,24],[1,0,1,4],[1,10,1,11],[1,12,1,15],[1,18,1,21],[1,23,1,24]]}
[{"$f":"大会名簿!D1","v":"第○○回　○○杯グラウンド・ゴルフ大会"}]
[{"$f":"大会名簿!D2","v":"Ａ組"},null,null,null,null,null,null,null,null,null,"大会日",null,{"$f":"大会名簿!H2","v":"令和○年○月○日"},null,null,null,null,null,null,null,null,null,"平均得点",{"$f":"W3/B3","v":83.666666666666671}]
[null,{"$f":"COUNT(B5:B324)","v":3},null,null,null,null,null,null,null,null,"ＮＯ１",null,null,"ＮＯ２",null,null,"ＮＯ３",null,null,"NO4",null,null,{"$f":"SUM(W5:W324)","v":251}]
["NO","順位","組","番号","チーム名","選手氏名","ふりがな","生年月日","年齢","年齢係数","１打数","２打数","計","１打数","２打数","計","１打数","２打数","計","１打数","２打数","計","得点計","１打数","２打数","順位再計算"]
[1,{"$f":"IF(W5=\"\",\"\",RANK(Z5,$Z$5:$Z$324,1))","v":2},{"$f":"大会名簿!C5","v":"１"},{"$f":"大会名簿!D5","v":"１"},{"$f":"IF(大会名簿!F5=\"\",\"\",大会名簿!F5)","v":"萩"},{"$f":"IF(大会名簿!G5=\"\",\"\",大会名簿!G5)","v":"萩　　四朗"},{"$f":"IF(大会名簿!H5=\"\",\"\",大会名簿!H5)","v":"はぎ　しろう"},{"$f":"IF(大会名簿!J5=\"\",\"\",大会名簿!J5)","v":"1922-05-03"},{"$f":"IF(H5=\"\",\"\",DATEDIF(H5,TODAY(),\"y\"))","v":100},{"$f":"H5","v":8159},1,null,20,null,1,22,null,null,40,null,null,null,{"$f":"IF(SUM(M5,P5,S5,V5)=0,\"\",(SUM(M5,P5,S5,V5)))","v":82},{"$f":"IF(F5=\"\",\"\",(SUM(K5,N5,Q5,T5)))","v":1},{"$f":"IF(F5=\"\",\"\",(SUM(L5,O5,R5,U5)))","v":1},{"$f":"IF(W5=\"\",\"\",(W5-X5*0.1-Y5*0.001+J5*0.00000001))","v":81.899081589999994}]
[2,1,{"$f":"大会名簿!C6","v":"１"},{"$f":"大会名簿!D6","v":"２"},{"$f":"IF(大会名簿!F6=\"\",\"\",大会名簿!F6)","v":"秋芳"},{"$f":"IF(大会名簿!G6=\"\",\"\",大会名簿!G6)","v":"秋芳　花子"},{"$f":"IF(大会名簿!H6=\"\",\"\",大会名簿!H6)","v":"しゅうほう　はなこ"},{"$f":"IF(大会名簿!J6=\"\",\"\",大会名簿!J6)","v":"1947-12-10"},75,17511,null,2,22,1,null,25,null,null,32,null,null,null,79,1,2,78.898175110000011]
[3,3,{"$f":"大会名簿!C7","v":"１"},{"$f":"大会名簿!D7","v":"３"},{"$f":"IF(大会名簿!F7=\"\",\"\",大会名簿!F7)","v":"山口"},{"$f":"IF(大会名簿!G7=\"\",\"\",大会名簿!G7)","v":"山口　五郎"},{"$f":"IF(大会名簿!H7=\"\",\"\",大会名簿!H7)","v":"やまぐち　ごろう"},{"$f":"IF(大会名簿!J7=\"\",\"\",大会名簿!J7)","v":"1948-12-14"},74,17881,null,null,25,null,null,30,null,null,35,null,null,null,90,0,0,90.000178809999994]
[4,"",{"$f":"大会名簿!C8","v":"１"},{"$f":"大会名簿!D8","v":"４"},{"$f":"IF(大会名簿!F8=\"\",\"\",大会名簿!F8)","v":""},{"$f":"IF(大会名簿!G8=\"\",\"\",大会名簿!G8)","v":""},{"$f":"IF(大会名簿!H8=\"\",\"\",大会名簿!H8)","v":""},{"$f":"IF(大会名簿!J8=\"\",\"\",大会名簿!J8)","v":""},"","",null,null,null,null,null,null,null,null,null,null,null,null,"","","",""]
{"$rows_left_out":317}
{"sheet":"操作説明","index":5,"n_rows":0,"n_cols":0,"rows_kept":0,"cut":false,"hidden":false,"merged":[[69,2,69,4]]}